Reaction Details
TargetCorticotropin-releasing factor receptor 1
LigandBDBM50348780
Substrate/Competitorn/a
Meas. Tech.ChEMBL_759196 (CHEMBL1811342)
Ki 5.9±n/a nM
Citation Hodgetts, KJGe, PYoon, TDe Lombaert, SBrodbeck, RGulianello, MKieltyka, AHorvath, RFKehne, JHKrause, JEMaynard, GDHoffman, DLee, YFung, LDoller, D Discovery of N-(1-ethylpropyl)-[3-methoxy-5-(2-methoxy-4-trifluoromethoxyphenyl)-6-methyl-pyrazin-2-yl]amine 59 (NGD 98-2): an orally active corticotropin releasing factor-1 (CRF-1) receptor antagonist. J Med Chem54:4187-206 (2011) 
 
Corticotropin-releasing factor receptor 1
Name:Corticotropin-releasing factor receptor 1
Type:Enzyme
Mol. Mass.:50744.31
Organism:Homo sapiens (Human)
Description:P34998
Residue:444
BDBM50348780
NameBDBM50348780
Synonyms:CHEMBL1807056
TypeSmall organic molecule
Emp. Form.C19H26ClN3O2
Mol. Mass.363.882
SMILESCCOc1ccc(c(Cl)c1)-c1nc(OC)c(NC(CC)CC)nc1C