Reaction Details
TargetCorticotropin-releasing factor receptor 1
LigandBDBM50348806
Substrate/Competitorn/a
Meas. Tech.ChEMBL_759196 (CHEMBL1811342)
Ki 19.2±n/a nM
Citation Hodgetts, KJGe, PYoon, TDe Lombaert, SBrodbeck, RGulianello, MKieltyka, AHorvath, RFKehne, JHKrause, JEMaynard, GDHoffman, DLee, YFung, LDoller, D Discovery of N-(1-ethylpropyl)-[3-methoxy-5-(2-methoxy-4-trifluoromethoxyphenyl)-6-methyl-pyrazin-2-yl]amine 59 (NGD 98-2): an orally active corticotropin releasing factor-1 (CRF-1) receptor antagonist. J Med Chem54:4187-206 (2011) 
 
Corticotropin-releasing factor receptor 1
Name:Corticotropin-releasing factor receptor 1
Type:Enzyme
Mol. Mass.:50744.31
Organism:Homo sapiens (Human)
Description:P34998
Residue:444
BDBM50348806
NameBDBM50348806
Synonyms:CHEMBL1807025
TypeSmall organic molecule
Emp. Form.C21H27Cl2N3
Mol. Mass.392.365
SMILESCCCN(CC1CC1)c1nc(CC)c(nc1CC)-c1ccc(Cl)cc1Cl