Reaction Details
TargetCorticotropin-releasing factor receptor 1
LigandBDBM50272704
Substrate/Competitorn/a
Meas. Tech.ChEMBL_759193 (CHEMBL1811339)
Ki 9±n/a nM
Citation Hodgetts, KJGe, PYoon, TDe Lombaert, SBrodbeck, RGulianello, MKieltyka, AHorvath, RFKehne, JHKrause, JEMaynard, GDHoffman, DLee, YFung, LDoller, D Discovery of N-(1-ethylpropyl)-[3-methoxy-5-(2-methoxy-4-trifluoromethoxyphenyl)-6-methyl-pyrazin-2-yl]amine 59 (NGD 98-2): an orally active corticotropin releasing factor-1 (CRF-1) receptor antagonist. J Med Chem54:4187-206 (2011) 
 
Corticotropin-releasing factor receptor 1
Name:Corticotropin-releasing factor receptor 1
Type:Enzyme
Mol. Mass.:50744.31
Organism:Homo sapiens (Human)
Description:P34998
Residue:444
BDBM50272704
NameBDBM50272704
Synonyms:2-(4-chloro-2,6-dimethoxyphenyl)-4-methoxy-6-methyl-5-(pentan-3-yloxy)pyrimidine | CHEMBL497653
TypeSmall organic molecule
Emp. Form.C19H25ClN2O4
Mol. Mass.380.866
SMILESCCC(CC)Oc1c(C)nc(nc1OC)-c1c(OC)cc(Cl)cc1OC