Reaction Details
TargetCorticotropin-releasing factor receptor 1
LigandBDBM50348828
Substrate/Competitorn/a
Meas. Tech.ChEMBL_759193 (CHEMBL1811339)
Ki 2±n/a nM
Citation Hodgetts, KJGe, PYoon, TDe Lombaert, SBrodbeck, RGulianello, MKieltyka, AHorvath, RFKehne, JHKrause, JEMaynard, GDHoffman, DLee, YFung, LDoller, D Discovery of N-(1-ethylpropyl)-[3-methoxy-5-(2-methoxy-4-trifluoromethoxyphenyl)-6-methyl-pyrazin-2-yl]amine 59 (NGD 98-2): an orally active corticotropin releasing factor-1 (CRF-1) receptor antagonist. J Med Chem54:4187-206 (2011) 
 
Corticotropin-releasing factor receptor 1
Name:Corticotropin-releasing factor receptor 1
Type:Enzyme
Mol. Mass.:50744.31
Organism:Homo sapiens (Human)
Description:P34998
Residue:444
BDBM50348828
NameBDBM50348828
Synonyms:CHEMBL1628268 | SR-125543A
TypeSmall organic molecule
Emp. Form.C27H28ClFN2OS
Mol. Mass.483.04
SMILESCOc1cc(Cl)c(cc1C)-c1nc(sc1C)N(CC#C)[C@@H](CC1CC1)c1ccc(C)c(F)c1