Reaction Details
TargetDelta-type opioid receptor
LigandBDBM50348871
Substrate/Competitorn/a
Meas. Tech.ChEMBL_757806 (CHEMBL1809750)
Ki>5000±n/a nM
Citation Li, FFolk, JECheng, KKurimura, MDeck, JADeschamps, JRRothman, RBDersch, CMJacobson, AERice, KC Probes for narcotic receptor mediated phenomena. 43. Synthesis of the ortho-a and para-a, and improved synthesis and optical resolution of the ortho-b and para-b oxide-bridged phenylmorphans: compounds with moderate to low opioid-receptor affinity. Bioorg Med Chem19:4330-7 (2011) 
 
Delta-type opioid receptor
Name:Delta-type opioid receptor
Type:G Protein-Coupled Receptor (GPCR)
Mol. Mass.:40382.98
Organism:Homo sapiens (Human)
Description:Competition binding assays were carried out using membrane preparations from transfected HN9.10 cells that constitutively expressed the delta opioid receptor.
Residue:372
BDBM50348871
NameBDBM50348871
Synonyms:CHEMBL1808303
TypeSmall organic molecule
Emp. Form.C22H25NO2
Mol. Mass.335.4394
SMILESOc1ccc2O[C@H]3CC[C@@H]4C[C@]3(CCN4CCc3ccccc3)c2c1