Reaction Details
TargetMu-type opioid receptor
LigandBDBM50348872
Substrate/Competitorn/a
Meas. Tech.ChEMBL_757805 (CHEMBL1809749)
Ki 384±n/a nM
Citation Li, FFolk, JECheng, KKurimura, MDeck, JADeschamps, JRRothman, RBDersch, CMJacobson, AERice, KC Probes for narcotic receptor mediated phenomena. 43. Synthesis of the ortho-a and para-a, and improved synthesis and optical resolution of the ortho-b and para-b oxide-bridged phenylmorphans: compounds with moderate to low opioid-receptor affinity. Bioorg Med Chem19:4330-7 (2011) 
 
Mu-type opioid receptor
Name:Mu-type opioid receptor
Type:G Protein-Coupled Receptor (GPCR)
Mol. Mass.:44789.51
Organism:Homo sapiens (Human)
Description:P35372
Residue:400
BDBM50348872
NameBDBM50348872
Synonyms:CHEMBL1808304
TypeSmall organic molecule
Emp. Form.C22H25NO2
Mol. Mass.335.4394
SMILESOc1cccc2c1O[C@H]1CC[C@@H]3C[C@]21CCN3CCc1ccccc1