Reaction Details
TargetKappa-type opioid receptor
LigandBDBM50273933
Substrate/Competitorn/a
Meas. Tech.ChEMBL_757807 (CHEMBL1809751)
Ki 102±n/a nM
Citation Li, FFolk, JECheng, KKurimura, MDeck, JADeschamps, JRRothman, RBDersch, CMJacobson, AERice, KC Probes for narcotic receptor mediated phenomena. 43. Synthesis of the ortho-a and para-a, and improved synthesis and optical resolution of the ortho-b and para-b oxide-bridged phenylmorphans: compounds with moderate to low opioid-receptor affinity. Bioorg Med Chem19:4330-7 (2011) 
 
Kappa-type opioid receptor
Name:Kappa-type opioid receptor
Type:G Protein-Coupled Receptor (GPCR)
Mol. Mass.:42648.76
Organism:Homo sapiens (Human)
Description:P41145
Residue:380
BDBM50273933
NameBDBM50273933
Synonyms:(4R*,6aS*,11bR*)-2,3,4,5,6,6a-Hexahydro-3-phenethyl-1H-4,11b-methanobenzofuro[3,2-d]azocine-10-ol | CHEMBL515681
TypeSmall organic molecule
Emp. Form.C22H25NO2
Mol. Mass.335.4394
SMILESOc1ccc2O[C@@H]3CC[C@H]4C[C@@]3(CCN4CCc3ccccc3)c2c1