Reaction Details
TargetKappa-type opioid receptor
LigandBDBM50348870
Substrate/Competitorn/a
Meas. Tech.ChEMBL_757807 (CHEMBL1809751)
Ki 98±n/a nM
Citation Li, FFolk, JECheng, KKurimura, MDeck, JADeschamps, JRRothman, RBDersch, CMJacobson, AERice, KC Probes for narcotic receptor mediated phenomena. 43. Synthesis of the ortho-a and para-a, and improved synthesis and optical resolution of the ortho-b and para-b oxide-bridged phenylmorphans: compounds with moderate to low opioid-receptor affinity. Bioorg Med Chem19:4330-7 (2011) 
 
Kappa-type opioid receptor
Name:Kappa-type opioid receptor
Type:G Protein-Coupled Receptor (GPCR)
Mol. Mass.:42648.76
Organism:Homo sapiens (Human)
Description:P41145
Residue:380
BDBM50348870
NameBDBM50348870
Synonyms:CHEMBL1808302
TypeSmall organic molecule
Emp. Form.C22H25NO2
Mol. Mass.335.4394
SMILESOc1ccc2O[C@@H]3CC[C@@H]4C[C@]3(CCN4CCc3ccccc3)c2c1