Reaction Details
TargetKappa-type opioid receptor
LigandBDBM50348868
Substrate/Competitorn/a
Meas. Tech.ChEMBL_757807 (CHEMBL1809751)
Ki>8600±n/a nM
Citation Li, FFolk, JECheng, KKurimura, MDeck, JADeschamps, JRRothman, RBDersch, CMJacobson, AERice, KC Probes for narcotic receptor mediated phenomena. 43. Synthesis of the ortho-a and para-a, and improved synthesis and optical resolution of the ortho-b and para-b oxide-bridged phenylmorphans: compounds with moderate to low opioid-receptor affinity. Bioorg Med Chem19:4330-7 (2011) 
 
Kappa-type opioid receptor
Name:Kappa-type opioid receptor
Type:G Protein-Coupled Receptor (GPCR)
Mol. Mass.:42648.76
Organism:Homo sapiens (Human)
Description:P41145
Residue:380
BDBM50348868
NameBDBM50348868
Synonyms:CHEMBL1808301
TypeSmall organic molecule
Emp. Form.C15H19NO2
Mol. Mass.245.3169
SMILESCN1CC[C@]23C[C@H]1CC[C@H]2Oc1ccc(O)cc31