Reaction Details
TargetInsulin receptor
LigandBDBM50348956
Substrate/Competitorn/a
Meas. Tech.ChEMBL_758704 (CHEMBL1810156)
IC50>40000±n/a nM
Citation Slavish, PJPrice, JEJiang, QCui, XMorris, SWWebb, TR Synthesis of an aryloxy oxo pyrimidinone library that displays ALK-selective inhibition. Bioorg Med Chem Lett21:4592-6 (2011) 
 
Insulin receptor
Name:Insulin receptor
Type:Receptor Tyrosine Kinase
Mol. Mass.:156322.60
Organism:Homo sapiens (Human)
Description:P06213
Residue:1382
BDBM50348956
NameBDBM50348956
Synonyms:CHEMBL1808093
TypeSmall organic molecule
Emp. Form.C16H15N3O4
Mol. Mass.313.308
SMILESCC(=O)Nc1ccc(Oc2nc[nH]c(=O)c2C=CC(C)=O)cc1