Reaction Details
TargetALK tyrosine kinase receptor
LigandBDBM50348958
Substrate/Competitorn/a
Meas. Tech.ChEMBL_758703 (CHEMBL1810103)
IC50 7570±n/a nM
Citation Slavish, PJPrice, JEJiang, QCui, XMorris, SWWebb, TR Synthesis of an aryloxy oxo pyrimidinone library that displays ALK-selective inhibition. Bioorg Med Chem Lett21:4592-6 (2011) 
 
ALK tyrosine kinase receptor
Name:ALK tyrosine kinase receptor
Type:Protein
Mol. Mass.:176453.10
Organism:Homo sapiens (Human)
Description:Q9UM73
Residue:1620
BDBM50348958
NameBDBM50348958
Synonyms:CHEMBL1808095
TypeSmall organic molecule
Emp. Form.C14H12N2O4
Mol. Mass.272.2561
SMILESCC(=O)C=Cc1c(Oc2ccc(O)cc2)nc[nH]c1=O