Reaction Details
TargetALK tyrosine kinase receptor
LigandBDBM50348954
Substrate/Competitorn/a
Meas. Tech.ChEMBL_758703 (CHEMBL1810103)
IC50>40000±n/a nM
Citation Slavish, PJPrice, JEJiang, QCui, XMorris, SWWebb, TR Synthesis of an aryloxy oxo pyrimidinone library that displays ALK-selective inhibition. Bioorg Med Chem Lett21:4592-6 (2011) 
 
ALK tyrosine kinase receptor
Name:ALK tyrosine kinase receptor
Type:Protein
Mol. Mass.:176453.10
Organism:Homo sapiens (Human)
Description:Q9UM73
Residue:1620
BDBM50348954
NameBDBM50348954
Synonyms:CHEMBL1808089
TypeSmall organic molecule
Emp. Form.C15H14N2O4
Mol. Mass.286.2827
SMILESCOc1cccc(Oc2nc[nH]c(=O)c2C=CC(C)=O)c1