Reaction Details
TargetInsulin receptor
LigandBDBM50348971
Substrate/Competitorn/a
Meas. Tech.ChEMBL_758704 (CHEMBL1810156)
IC50>40000±n/a nM
Citation Slavish, PJPrice, JEJiang, QCui, XMorris, SWWebb, TR Synthesis of an aryloxy oxo pyrimidinone library that displays ALK-selective inhibition. Bioorg Med Chem Lett21:4592-6 (2011) 
 
Insulin receptor
Name:Insulin receptor
Type:Receptor Tyrosine Kinase
Mol. Mass.:156322.60
Organism:Homo sapiens (Human)
Description:P06213
Residue:1382
BDBM50348971
NameBDBM50348971
Synonyms:CHEMBL1806514
TypeSmall organic molecule
Emp. Form.C18H18N4O5
Mol. Mass.370.3593
SMILESCOC(=O)c1cccc(Oc2nc[nH]c(=O)c2C2CC(C)=NN2C(C)=O)c1