Reaction Details
TargetInsulin receptor
LigandBDBM50348942
Substrate/Competitorn/a
Meas. Tech.ChEMBL_758704 (CHEMBL1810156)
IC50>40000±n/a nM
Citation Slavish, PJPrice, JEJiang, QCui, XMorris, SWWebb, TR Synthesis of an aryloxy oxo pyrimidinone library that displays ALK-selective inhibition. Bioorg Med Chem Lett21:4592-6 (2011) 
 
Insulin receptor
Name:Insulin receptor
Type:Receptor Tyrosine Kinase
Mol. Mass.:156322.60
Organism:Homo sapiens (Human)
Description:P06213
Residue:1382
BDBM50348942
NameBDBM50348942
Synonyms:CHEMBL1807759
TypeSmall organic molecule
Emp. Form.C15H14N2O3
Mol. Mass.270.2833
SMILESCC(=O)C=Cc1c(Oc2ccc(C)cc2)nc[nH]c1=O