Reaction Details
TargetHepatocyte growth factor receptor
LigandBDBM50348949
Substrate/Competitorn/a
Meas. Tech.ChEMBL_758705 (CHEMBL1810157)
IC50>40000±n/a nM
Citation Slavish, PJPrice, JEJiang, QCui, XMorris, SWWebb, TR Synthesis of an aryloxy oxo pyrimidinone library that displays ALK-selective inhibition. Bioorg Med Chem Lett21:4592-6 (2011) 
 
Hepatocyte growth factor receptor
Name:Hepatocyte growth factor receptor
Type:Protein
Mol. Mass.:155559.73
Organism:Homo sapiens (Human)
Description:P08581
Residue:1390
BDBM50348949
NameBDBM50348949
Synonyms:CHEMBL1807770
TypeSmall organic molecule
Emp. Form.C17H18N2O6
Mol. Mass.346.3346
SMILESCCOC(=O)C=Cc1c(Oc2c(OC)cccc2OC)nc[nH]c1=O