Reaction Details
TargetHepatocyte growth factor receptor
LigandBDBM50348951
Substrate/Competitorn/a
Meas. Tech.ChEMBL_758705 (CHEMBL1810157)
IC50>40000±n/a nM
Citation Slavish, PJPrice, JEJiang, QCui, XMorris, SWWebb, TR Synthesis of an aryloxy oxo pyrimidinone library that displays ALK-selective inhibition. Bioorg Med Chem Lett21:4592-6 (2011) 
 
Hepatocyte growth factor receptor
Name:Hepatocyte growth factor receptor
Type:Protein
Mol. Mass.:155559.73
Organism:Homo sapiens (Human)
Description:P08581
Residue:1390
BDBM50348951
NameBDBM50348951
Synonyms:CHEMBL1807772
TypeSmall organic molecule
Emp. Form.C16H13N3O4
Mol. Mass.311.2921
SMILESCCOC(=O)C=Cc1c(Oc2cccc(c2)C#N)nc[nH]c1=O