Reaction Details
TargetHepatocyte growth factor receptor
LigandBDBM50348970
Substrate/Competitorn/a
Meas. Tech.ChEMBL_758705 (CHEMBL1810157)
IC50>40000±n/a nM
Citation Slavish, PJPrice, JEJiang, QCui, XMorris, SWWebb, TR Synthesis of an aryloxy oxo pyrimidinone library that displays ALK-selective inhibition. Bioorg Med Chem Lett21:4592-6 (2011) 
 
Hepatocyte growth factor receptor
Name:Hepatocyte growth factor receptor
Type:Protein
Mol. Mass.:155559.73
Organism:Homo sapiens (Human)
Description:P08581
Residue:1390
BDBM50348970
NameBDBM50348970
Synonyms:CHEMBL1808108
TypeSmall organic molecule
Emp. Form.C16H16N2O5
Mol. Mass.316.3086
SMILESCOC(=O)c1cccc(Oc2nc[nH]c(=O)c2CCC(C)=O)c1