Reaction Details
TargetVascular endothelial growth factor receptor 1
LigandBDBM50349001
Substrate/Competitorn/a
Meas. Tech.ChEMBL_758710 (CHEMBL1810162)
IC50 210±n/a nM
Citation Lin, WHHsieh, SYYen, SCChen, CTYeh, TKHsu, TLu, CTChen, CPChen, CWChou, LHHuang, YLCheng, AHChang, YITseng, YJYen, KRChao, YSHsu, JTJiaang, WT Discovery and evaluation of 3-phenyl-1H-5-pyrazolylamine-based derivatives as potent, selective and efficacious inhibitors of FMS-like tyrosine kinase-3 (FLT3). Bioorg Med Chem19:4173-82 (2011) 
 
Vascular endothelial growth factor receptor 1
Name:Vascular endothelial growth factor receptor 1
Type:Receptor Tyrosine Kinase
Mol. Mass.:150800.23
Organism:Homo sapiens (Human)
Description:P17948
Residue:1338
BDBM50349001
NameBDBM50349001
Synonyms:CHEMBL1807392
TypeSmall organic molecule
Emp. Form.C27H28N6O3S
Mol. Mass.516.615
SMILESCN1CCN(CC1)c1ccc(cc1)C(=O)Nc1cc(n[nH]1)-c1cccc(NS(=O)(=O)c2ccccc2)c1