Reaction Details
TargetVascular endothelial growth factor receptor 1
LigandBDBM50349013
Substrate/Competitorn/a
Meas. Tech.ChEMBL_758710 (CHEMBL1810162)
IC50 270±n/a nM
Citation Lin, WHHsieh, SYYen, SCChen, CTYeh, TKHsu, TLu, CTChen, CPChen, CWChou, LHHuang, YLCheng, AHChang, YITseng, YJYen, KRChao, YSHsu, JTJiaang, WT Discovery and evaluation of 3-phenyl-1H-5-pyrazolylamine-based derivatives as potent, selective and efficacious inhibitors of FMS-like tyrosine kinase-3 (FLT3). Bioorg Med Chem19:4173-82 (2011) 
 
Vascular endothelial growth factor receptor 1
Name:Vascular endothelial growth factor receptor 1
Type:Receptor Tyrosine Kinase
Mol. Mass.:150800.23
Organism:Homo sapiens (Human)
Description:P17948
Residue:1338
BDBM50349013
NameBDBM50349013
Synonyms:CHEMBL1807478
TypeSmall organic molecule
Emp. Form.C28H29N5O4S
Mol. Mass.531.626
SMILESO=C(Nc1cc(n[nH]1)-c1cccc(NS(=O)(=O)c2ccccc2)c1)c1ccc(OCCN2CCCC2)cc1