Reaction Details
TargetVascular endothelial growth factor receptor 1
LigandBDBM50349016
Substrate/Competitorn/a
Meas. Tech.ChEMBL_758710 (CHEMBL1810162)
IC50>1000000±n/a nM
Citation Lin, WHHsieh, SYYen, SCChen, CTYeh, TKHsu, TLu, CTChen, CPChen, CWChou, LHHuang, YLCheng, AHChang, YITseng, YJYen, KRChao, YSHsu, JTJiaang, WT Discovery and evaluation of 3-phenyl-1H-5-pyrazolylamine-based derivatives as potent, selective and efficacious inhibitors of FMS-like tyrosine kinase-3 (FLT3). Bioorg Med Chem19:4173-82 (2011) 
 
Vascular endothelial growth factor receptor 1
Name:Vascular endothelial growth factor receptor 1
Type:Receptor Tyrosine Kinase
Mol. Mass.:150800.23
Organism:Homo sapiens (Human)
Description:P17948
Residue:1338
BDBM50349016
NameBDBM50349016
Synonyms:CHEMBL1807484
TypeSmall organic molecule
Emp. Form.C26H30N8O2S
Mol. Mass.518.634
SMILESCN1CCN(CC1)c1cc(Nc2cc(n[nH]2)-c2cccc(NS(=O)(=O)c3cccc(C)c3)c2)nc(C)n1