Reaction Details
TargetVascular endothelial growth factor receptor 1
LigandBDBM50349022
Substrate/Competitorn/a
Meas. Tech.ChEMBL_758710 (CHEMBL1810162)
IC50>1000000±n/a nM
Citation Lin, WHHsieh, SYYen, SCChen, CTYeh, TKHsu, TLu, CTChen, CPChen, CWChou, LHHuang, YLCheng, AHChang, YITseng, YJYen, KRChao, YSHsu, JTJiaang, WT Discovery and evaluation of 3-phenyl-1H-5-pyrazolylamine-based derivatives as potent, selective and efficacious inhibitors of FMS-like tyrosine kinase-3 (FLT3). Bioorg Med Chem19:4173-82 (2011) 
 
Vascular endothelial growth factor receptor 1
Name:Vascular endothelial growth factor receptor 1
Type:Receptor Tyrosine Kinase
Mol. Mass.:150800.23
Organism:Homo sapiens (Human)
Description:P17948
Residue:1338
BDBM50349022
NameBDBM50349022
Synonyms:CHEMBL1807789
TypeSmall organic molecule
Emp. Form.C27H32N8O3S
Mol. Mass.548.66
SMILESCc1nc(NCCCN2CCOCC2)cc(Nc2cc(n[nH]2)-c2cccc(NS(=O)(=O)c3ccccc3)c2)n1