Reaction Details
TargetVascular endothelial growth factor receptor 2
LigandBDBM50349006
Substrate/Competitorn/a
Meas. Tech.ChEMBL_758709 (CHEMBL1810161)
IC50 160±n/a nM
Citation Lin, WHHsieh, SYYen, SCChen, CTYeh, TKHsu, TLu, CTChen, CPChen, CWChou, LHHuang, YLCheng, AHChang, YITseng, YJYen, KRChao, YSHsu, JTJiaang, WT Discovery and evaluation of 3-phenyl-1H-5-pyrazolylamine-based derivatives as potent, selective and efficacious inhibitors of FMS-like tyrosine kinase-3 (FLT3). Bioorg Med Chem19:4173-82 (2011) 
 
Vascular endothelial growth factor receptor 2
Name:Vascular endothelial growth factor receptor 2
Type:Receptor Tyrosine Kinase
Mol. Mass.:151510.97
Organism:Homo sapiens (Human)
Description:P35968
Residue:1356
BDBM50349006
NameBDBM50349006
Synonyms:CHEMBL1807471
TypeSmall organic molecule
Emp. Form.C28H30N6O4S
Mol. Mass.546.641
SMILESCOc1ccc(cc1)S(=O)(=O)Nc1cccc(c1)-c1cc(NC(=O)c2ccc(cc2)N2CCN(C)CC2)[nH]n1