Reaction Details
TargetAurora kinase A
LigandBDBM50349020
Substrate/Competitorn/a
Meas. Tech.ChEMBL_758708 (CHEMBL1810160)
IC50>1000000±n/a nM
Citation Lin, WHHsieh, SYYen, SCChen, CTYeh, TKHsu, TLu, CTChen, CPChen, CWChou, LHHuang, YLCheng, AHChang, YITseng, YJYen, KRChao, YSHsu, JTJiaang, WT Discovery and evaluation of 3-phenyl-1H-5-pyrazolylamine-based derivatives as potent, selective and efficacious inhibitors of FMS-like tyrosine kinase-3 (FLT3). Bioorg Med Chem19:4173-82 (2011) 
 
Aurora kinase A
Name:Aurora kinase A
Type:Serine/threonine-protein kinase
Mol. Mass.:45830.98
Organism:Homo sapiens (Human)
Description:O14965
Residue:403
BDBM50349020
NameBDBM50349020
Synonyms:CHEMBL1807787
TypeSmall organic molecule
Emp. Form.C24H28N8O2S
Mol. Mass.492.597
SMILESCN(C)CCNc1cc(Nc2cc(n[nH]2)-c2cccc(NS(=O)(=O)c3ccccc3)c2)nc(C)n1