Reaction Details
TargetHeat shock protein HSP 90-alpha
LigandBDBM50349033
Substrate/Competitorn/a
Meas. Tech.ChEMBL_758910 (CHEMBL1810576)
IC50 116±n/a nM
Citation Zapf, CWBloom, JDLi, ZDushin, RGNittoli, TOtteng, MNikitenko, AGolas, JMLiu, HLucas, JBoschelli, FVogan, EOlland, AJohnson, MLevin, JI Discovery of a stable macrocyclic o-aminobenzamide Hsp90 inhibitor which significantly decreases tumor volume in a mouse xenograft model. Bioorg Med Chem Lett21:4602-7 (2011) 
 
Heat shock protein HSP 90-alpha
Name:Heat shock protein HSP 90-alpha
Type:Molecular Chaperone
Mol. Mass.:84623.45
Organism:Homo sapiens (Human)
Description:P07900
Residue:732
BDBM50349033
NameBDBM50349033
Synonyms:CHEMBL1807792
TypeSmall organic molecule
Emp. Form.C26H36N4O2
Mol. Mass.436.5896
SMILESC[C@@H]1Nc2cc(ccc2C(N)=O)-n2c3CC(C)(C)CC(=O)c3c(C)c2CCCN(C)[C@H]1C