Reaction Details
TargetHeat shock protein HSP 90-alpha
LigandBDBM50345151
Substrate/Competitorn/a
Meas. Tech.ChEMBL_758910 (CHEMBL1810576)
IC50 96±n/a nM
Citation Zapf, CWBloom, JDLi, ZDushin, RGNittoli, TOtteng, MNikitenko, AGolas, JMLiu, HLucas, JBoschelli, FVogan, EOlland, AJohnson, MLevin, JI Discovery of a stable macrocyclic o-aminobenzamide Hsp90 inhibitor which significantly decreases tumor volume in a mouse xenograft model. Bioorg Med Chem Lett21:4602-7 (2011) 
 
Heat shock protein HSP 90-alpha
Name:Heat shock protein HSP 90-alpha
Type:Molecular Chaperone
Mol. Mass.:84623.45
Organism:Homo sapiens (Human)
Description:P07900
Residue:732
BDBM50345151
NameBDBM50345151
Synonyms:CHEMBL1779531
TypeSmall organic molecule
Emp. Form.C26H34N4O2
Mol. Mass.434.5738
SMILESCc1c2CCCN3CCC[C@H]3CNc3cc(ccc3C(N)=O)-n2c2CC(C)(C)CC(=O)c12