Reaction Details
TargetHeat shock protein HSP 90-alpha
LigandBDBM50349053
Substrate/Competitorn/a
Meas. Tech.ChEMBL_758910 (CHEMBL1810576)
IC50 183±n/a nM
Citation Zapf, CWBloom, JDLi, ZDushin, RGNittoli, TOtteng, MNikitenko, AGolas, JMLiu, HLucas, JBoschelli, FVogan, EOlland, AJohnson, MLevin, JI Discovery of a stable macrocyclic o-aminobenzamide Hsp90 inhibitor which significantly decreases tumor volume in a mouse xenograft model. Bioorg Med Chem Lett21:4602-7 (2011) 
 
Heat shock protein HSP 90-alpha
Name:Heat shock protein HSP 90-alpha
Type:Molecular Chaperone
Mol. Mass.:84623.45
Organism:Homo sapiens (Human)
Description:P07900
Residue:732
BDBM50349053
NameBDBM50349053
Synonyms:CHEMBL1807812
TypeSmall organic molecule
Emp. Form.C28H38N4O4
Mol. Mass.494.6257
SMILESC[C@H](O)C(=O)N1CCc2c(C)c3c(CC(C)(C)CC3=O)n2-c2ccc(C(N)=O)c(N[C@@H](C)[C@H](C)C1)c2