Reaction Details
TargetInsulin-like growth factor 1 receptor
LigandBDBM7657
Substrate/Competitorn/a
Meas. Tech.ChEMBL_759531 (CHEMBL1811057)
IC50 1260±n/a nM
Citation Ducray, RSimpson, IJung, FHNissink, JWKenny, PWFitzek, MWalker, GEWard, LTHudson, K Discovery of novel imidazo[1,2-a]pyridines as inhibitors of the insulin-like growth factor-1 receptor tyrosine kinase. Bioorg Med Chem Lett21:4698-701 (2011) 
 
Insulin-like growth factor 1 receptor
Name:Insulin-like growth factor 1 receptor
Type:Protein
Mol. Mass.:154776.79
Organism:Homo sapiens (Human)
Description:P08069
Residue:1367
BDBM7657
NameBDBM7657
Synonyms:4-[(4-{imidazo[1,2-a]pyridin-3-yl}pyrimidin-2-yl)amino]benzene-1-sulfonamide Imidazo[1,2-a]pyridine deriv. 1h
TypeSmall organic molecule
Emp. Form.C17H14N6O2S
Mol. Mass.366.397
SMILESNS(=O)(=O)c1ccc(Nc2nccc(n2)-c2cnc3ccccn23)cc1