Reaction Details
TargetGlutamate receptor ionotropic, kainate 1
LigandBDBM50252920
Substrate/Competitorn/a
Meas. Tech.ChEMBL_761797 (CHEMBL1817064)
Ki 5.2±n/a nM
Citation Venskutonyte, RButini, SCoccone, SSGemma, SBrindisi, MKumar, VGuarino, EMaramai, SValenti, SAmir, AValadés, EAFrydenvang, KKastrup, JSNovellino, ECampiani, GPickering, DS Selective kainate receptor (GluK1) ligands structurally based upon 1H-cyclopentapyrimidin-2,4(1H,3H)-dione: synthesis, molecular modeling, and pharmacological and biostructural characterization. J Med Chem54:4793-805 (2011) 
 
Glutamate receptor ionotropic, kainate 1
Name:Glutamate receptor ionotropic, kainate 1
Type:Enzyme Catalytic Domain
Mol. Mass.:107860.82
Organism:RAT
Description:P22756
Residue:949
BDBM50252920
NameBDBM50252920
Synonyms:(S)-1-[2'-Amino-2'-carboxyethyl]-5,7-dihydrothieno[3,4-d]pyrimidin-2,4(1H,3H)-dione | CHEMBL492469
TypeSmall organic molecule
Emp. Form.C9H11N3O4S
Mol. Mass.257.266
SMILESN[C@@H](Cn1c2CSCc2c(=O)[nH]c1=O)C(O)=O