Reaction Details
TargetAcetyl-CoA carboxylase 2
LigandBDBM50350740
Substrate/Competitorn/a
Meas. Tech.ChEMBL_762997 (CHEMBL1820814)
IC50 570±n/a nM
Citation Bengtsson, CBlaho, SSaitton, DBBrickmann, KBroddefalk, JDavidsson, ODrmota, TFolmer, RHallberg, KHallén, SHovland, RIsin, EJohannesson, PKull, BLarsson, LOLöfgren, LNilsson, KENoeske, TOakes, NPlowright, ATSchnecke, VStåhlberg, PSörme, PWan, HWellner, EOster, L Design of small molecule inhibitors of acetyl-CoA carboxylase 1 and 2 showing reduction of hepatic malonyl-CoA levels in vivo in obese Zucker rats. Bioorg Med Chem19:3039-53 (2011) 
 
Acetyl-CoA carboxylase 2
Name:Acetyl-CoA carboxylase 2
Type:Protein
Mol. Mass.:276535.21
Organism:Homo sapiens (Human)
Description:O00763
Residue:2458
BDBM50350740
NameBDBM50350740
Synonyms:CHEMBL1818195
TypeSmall organic molecule
Emp. Form.C26H33N5O3
Mol. Mass.463.5719
SMILESCC(C)(C)OC(=O)NC[C@H]1CC[C@H](CNC(=O)c2cc(nc3ccccc23)-c2cn[nH]c2)CC1