Reaction Details
TargetAcetyl-CoA carboxylase 2
LigandBDBM50350753
Substrate/Competitorn/a
Meas. Tech.ChEMBL_762997 (CHEMBL1820814)
IC50 130±n/a nM
Citation Bengtsson, CBlaho, SSaitton, DBBrickmann, KBroddefalk, JDavidsson, ODrmota, TFolmer, RHallberg, KHallén, SHovland, RIsin, EJohannesson, PKull, BLarsson, LOLöfgren, LNilsson, KENoeske, TOakes, NPlowright, ATSchnecke, VStåhlberg, PSörme, PWan, HWellner, EOster, L Design of small molecule inhibitors of acetyl-CoA carboxylase 1 and 2 showing reduction of hepatic malonyl-CoA levels in vivo in obese Zucker rats. Bioorg Med Chem19:3039-53 (2011) 
 
Acetyl-CoA carboxylase 2
Name:Acetyl-CoA carboxylase 2
Type:Protein
Mol. Mass.:276535.21
Organism:Homo sapiens (Human)
Description:O00763
Residue:2458
BDBM50350753
NameBDBM50350753
Synonyms:CHEMBL1818303
TypeSmall organic molecule
Emp. Form.C33H51N5O3
Mol. Mass.565.7897
SMILESCN(C)CCC1CCN(CC1)c1cc(C(=O)NC[C@H]2CC[C@H](CNC(=O)OCC(C)(C)C)CC2)c2ccccc2n1