Reaction Details
TargetAcetyl-CoA carboxylase 1
LigandBDBM50350743
Substrate/Competitorn/a
Meas. Tech.ChEMBL_762998 (CHEMBL1820815)
IC50 2900±n/a nM
Citation Bengtsson, CBlaho, SSaitton, DBBrickmann, KBroddefalk, JDavidsson, ODrmota, TFolmer, RHallberg, KHallén, SHovland, RIsin, EJohannesson, PKull, BLarsson, LOLöfgren, LNilsson, KENoeske, TOakes, NPlowright, ATSchnecke, VStåhlberg, PSörme, PWan, HWellner, EOster, L Design of small molecule inhibitors of acetyl-CoA carboxylase 1 and 2 showing reduction of hepatic malonyl-CoA levels in vivo in obese Zucker rats. Bioorg Med Chem19:3039-53 (2011) 
 
Acetyl-CoA carboxylase 1
Name:Acetyl-CoA carboxylase 1
Type:Protein
Mol. Mass.:265543.22
Organism:Homo sapiens (Human)
Description:Q13085
Residue:2346
BDBM50350743
NameBDBM50350743
Synonyms:CHEMBL1818292
TypeSmall organic molecule
Emp. Form.C30H35N3O5
Mol. Mass.517.616
SMILESCC(C)(C)OC(=O)NC[C@H]1CC[C@H](CNC(=O)c2cc(nc3ccccc23)-c2ccc(cc2)C(O)=O)CC1