Reaction Details
TargetAcetyl-CoA carboxylase 1
LigandBDBM50350755
Substrate/Competitorn/a
Meas. Tech.ChEMBL_762998 (CHEMBL1820815)
IC50 4500±n/a nM
Citation Bengtsson, CBlaho, SSaitton, DBBrickmann, KBroddefalk, JDavidsson, ODrmota, TFolmer, RHallberg, KHallén, SHovland, RIsin, EJohannesson, PKull, BLarsson, LOLöfgren, LNilsson, KENoeske, TOakes, NPlowright, ATSchnecke, VStåhlberg, PSörme, PWan, HWellner, EOster, L Design of small molecule inhibitors of acetyl-CoA carboxylase 1 and 2 showing reduction of hepatic malonyl-CoA levels in vivo in obese Zucker rats. Bioorg Med Chem19:3039-53 (2011) 
 
Acetyl-CoA carboxylase 1
Name:Acetyl-CoA carboxylase 1
Type:Protein
Mol. Mass.:265543.22
Organism:Homo sapiens (Human)
Description:Q13085
Residue:2346
BDBM50350755
NameBDBM50350755
Synonyms:CHEMBL1818299
TypeSmall organic molecule
Emp. Form.C30H45N5O4
Mol. Mass.539.7094
SMILESCN(C)CCOC1CN(C1)c1cc(C(=O)NC[C@H]2CC[C@H](CNC(=O)OC(C)(C)C)CC2)c2ccccc2n1