Reaction Details
TargetcAMP and cAMP-inhibited cGMP 3',5'-cyclic phosphodiesterase 10A
LigandBDBM50350800
Substrate/Competitorn/a
Meas. Tech.ChEMBL_763299 (CHEMBL1820393)
IC50 5±n/a nM
Citation Helal, CJKang, ZHou, XPandit, JChappie, TAHumphrey, JMMarr, ESFennell, KFChenard, LKFox, CSchmidt, CJWilliams, RDChapin, DSSiuciak, JLebel, LMenniti, FCianfrogna, JFonseca, KRNelson, FRO'Connor, RMacDougall, MMcDowell, LLiras, S Use of structure-based design to discover a potent, selective, in vivo active phosphodiesterase 10A inhibitor lead series for the treatment of schizophrenia. J Med Chem54:4536-47 (2011) 
 
cAMP and cAMP-inhibited cGMP 3',5'-cyclic phosphodiesterase 10A
Name:cAMP and cAMP-inhibited cGMP 3',5'-cyclic phosphodiesterase 10A
Type:Enzyme
Mol. Mass.:90160.88
Organism:Rattus norvegicus (rat)
Description:PDE10A was generated from the full-length recombinant rat clone transfected into Sf9 cells.
Residue:794
BDBM50350800
NameBDBM50350800
Synonyms:CHEMBL1819135
TypeSmall organic molecule
Emp. Form.C25H20N4O2
Mol. Mass.408.4519
SMILESCOc1cc2ncnc(-c3cccnc3)c2cc1OCCc1ccc2ccccc2n1