Reaction Details
TargetcAMP and cAMP-inhibited cGMP 3',5'-cyclic phosphodiesterase 10A
LigandBDBM50350801
Substrate/Competitorn/a
Meas. Tech.ChEMBL_763299 (CHEMBL1820393)
IC50 12±n/a nM
Citation Helal, CJKang, ZHou, XPandit, JChappie, TAHumphrey, JMMarr, ESFennell, KFChenard, LKFox, CSchmidt, CJWilliams, RDChapin, DSSiuciak, JLebel, LMenniti, FCianfrogna, JFonseca, KRNelson, FRO'Connor, RMacDougall, MMcDowell, LLiras, S Use of structure-based design to discover a potent, selective, in vivo active phosphodiesterase 10A inhibitor lead series for the treatment of schizophrenia. J Med Chem54:4536-47 (2011) 
 
cAMP and cAMP-inhibited cGMP 3',5'-cyclic phosphodiesterase 10A
Name:cAMP and cAMP-inhibited cGMP 3',5'-cyclic phosphodiesterase 10A
Type:Enzyme
Mol. Mass.:90160.88
Organism:Rattus norvegicus (rat)
Description:PDE10A was generated from the full-length recombinant rat clone transfected into Sf9 cells.
Residue:794
BDBM50350801
NameBDBM50350801
Synonyms:CHEMBL1819136
TypeSmall organic molecule
Emp. Form.C21H19N3O3
Mol. Mass.361.3939
SMILESCOc1cc2ncn(C)c(=O)c2cc1OCCc1ccc2ccccc2n1