Reaction Details
TargetcAMP and cAMP-inhibited cGMP 3',5'-cyclic phosphodiesterase 10A
LigandBDBM50350802
Substrate/Competitorn/a
Meas. Tech.ChEMBL_763299 (CHEMBL1820393)
IC50 146±n/a nM
Citation Helal, CJKang, ZHou, XPandit, JChappie, TAHumphrey, JMMarr, ESFennell, KFChenard, LKFox, CSchmidt, CJWilliams, RDChapin, DSSiuciak, JLebel, LMenniti, FCianfrogna, JFonseca, KRNelson, FRO'Connor, RMacDougall, MMcDowell, LLiras, S Use of structure-based design to discover a potent, selective, in vivo active phosphodiesterase 10A inhibitor lead series for the treatment of schizophrenia. J Med Chem54:4536-47 (2011) 
 
cAMP and cAMP-inhibited cGMP 3',5'-cyclic phosphodiesterase 10A
Name:cAMP and cAMP-inhibited cGMP 3',5'-cyclic phosphodiesterase 10A
Type:Enzyme
Mol. Mass.:90160.88
Organism:Rattus norvegicus (rat)
Description:PDE10A was generated from the full-length recombinant rat clone transfected into Sf9 cells.
Residue:794
BDBM50350802
NameBDBM50350802
Synonyms:CHEMBL1819121
TypeSmall organic molecule
Emp. Form.C21H23N3O2
Mol. Mass.349.4262
SMILESCOc1cc2ncnc(N3CCCC(C3)c3ccccc3)c2cc1OC