Reaction Details
TargetcGMP-inhibited 3',5'-cyclic phosphodiesterase 3A
LigandBDBM50350805
Substrate/Competitorn/a
Meas. Tech.ChEMBL_763289 (CHEMBL1820383)
IC50 98±n/a nM
Citation Helal, CJKang, ZHou, XPandit, JChappie, TAHumphrey, JMMarr, ESFennell, KFChenard, LKFox, CSchmidt, CJWilliams, RDChapin, DSSiuciak, JLebel, LMenniti, FCianfrogna, JFonseca, KRNelson, FRO'Connor, RMacDougall, MMcDowell, LLiras, S Use of structure-based design to discover a potent, selective, in vivo active phosphodiesterase 10A inhibitor lead series for the treatment of schizophrenia. J Med Chem54:4536-47 (2011) 
 
cGMP-inhibited 3',5'-cyclic phosphodiesterase 3A
Name:cGMP-inhibited 3',5'-cyclic phosphodiesterase 3A
Type:Enzyme
Mol. Mass.:124966.46
Organism:Homo sapiens (Human)
Description:Q14432
Residue:1141
BDBM50350805
NameBDBM50350805
Synonyms:CHEMBL1819122
TypeSmall organic molecule
Emp. Form.C23H27N3O2
Mol. Mass.377.4794
SMILESCCCOc1cc2c(ncnc2cc1OC)N1CCCC(C1)c1ccccc1