Reaction Details
TargetSolute carrier family 5 member 4
LigandBDBM50351436
Substrate/Competitorn/a
Meas. Tech.ChEMBL_764617 (CHEMBL1821169)
IC50 29±n/a nM
Citation Ohtake, YSato, TMatsuoka, HNishimoto, MTaka, NTakano, KYamamoto, KOhmori, MHiguchi, TMurakata, MKobayashi, TMorikawa, KShimma, NSuzuki, MHagita, HOzawa, KYamaguchi, KKato, MIkeda, S 5a-Carba-ß-D-glucopyranose derivatives as novel sodium-dependent glucose cotransporter 2 (SGLT2) inhibitors for the treatment of type 2 diabetes. Bioorg Med Chem19:5334-41 (2011) 
 
Solute carrier family 5 member 4
Name:Solute carrier family 5 member 4
Type:PROTEIN
Mol. Mass.:72452.26
Organism:Homo sapiens (Human)
Description:ChEMBL_764617
Residue:659
BDBM50351436
NameBDBM50351436
Synonyms:CHEMBL1819490
TypeSmall organic molecule
Emp. Form.C22H26O5
Mol. Mass.370.4388
SMILESOC[C@H]1C[C@@H](Oc2ccccc2Cc2ccc(C=C)cc2)[C@H](O)[C@@H](O)[C@@H]1O