Reaction Details
TargetSodium/glucose cotransporter 1
LigandBDBM50351442
Substrate/Competitorn/a
Meas. Tech.ChEMBL_764618 (CHEMBL1821170)
IC50 22000±n/a nM
Citation Ohtake, YSato, TMatsuoka, HNishimoto, MTaka, NTakano, KYamamoto, KOhmori, MHiguchi, TMurakata, MKobayashi, TMorikawa, KShimma, NSuzuki, MHagita, HOzawa, KYamaguchi, KKato, MIkeda, S 5a-Carba-ß-D-glucopyranose derivatives as novel sodium-dependent glucose cotransporter 2 (SGLT2) inhibitors for the treatment of type 2 diabetes. Bioorg Med Chem19:5334-41 (2011) 
 
Sodium/glucose cotransporter 1
Name:Sodium/glucose cotransporter 1
Type:Protein
Mol. Mass.:73503.78
Organism:Homo sapiens (Human)
Description:P13866
Residue:664
BDBM50351442
NameBDBM50351442
Synonyms:CHEMBL1819495
TypeSmall organic molecule
Emp. Form.C20H23ClO5
Mol. Mass.378.847
SMILESOC[C@H]1C[C@@H](Oc2ccccc2Cc2ccc(Cl)cc2)[C@H](O)[C@@H](O)[C@@H]1O