Reaction Details
TargetP2X purinoceptor 7
LigandBDBM50352059
Substrate/Competitorn/a
Meas. Tech.ChEMBL_766437 (CHEMBL1826577)
IC50 3±n/a nM
Citation Subramanyam, CDuplantier, AJDombroski, MAChang, SPGabel, CAWhitney-Pickett, CPerregaux, DGLabasi, JMYoon, KShepard, RMFisher, M Discovery, synthesis and SAR of azinyl- and azolylbenzamides antagonists of the P2X7 receptor. Bioorg Med Chem Lett21:5475-9 (2011) 
 
P2X purinoceptor 7
Name:P2X purinoceptor 7
Type:Protein
Mol. Mass.:68602.85
Organism:Homo sapiens (Human)
Description:Q99572
Residue:595
BDBM50352059
NameBDBM50352059
Synonyms:CHEMBL1824026
TypeSmall organic molecule
Emp. Form.C22H31ClN4O3
Mol. Mass.434.96
SMILESCc1cc(nn1C[C@@H](O)CN)-c1ccc(Cl)c(c1)C(=O)NCC1(O)CCCCCC1