Reaction Details
TargetTranscriptional regulator ERG
LigandBDBM50352422
Substrate/Competitorn/a
Meas. Tech.ChEBML_766760
IC50 32000±n/a nM
Citation Ontoria, JMBufi, LLTorrisi, CBresciani, AGiomini, CRowley, MSerafini, SBin, HHao, WSteinkühler, CJones, P Identification of a series of 4-[3-(quinolin-2-yl)-1,2,4-oxadiazol-5-yl]piperazinyl ureas as potent smoothened antagonist hedgehog pathway inhibitors. Bioorg Med Chem Lett21:5274-82 (2011) 
 
Transcriptional regulator ERG
Name:Transcriptional regulator ERG
Type:PROTEIN
Mol. Mass.:54615.84
Organism:Homo sapiens (Human)
Description:ChEMBL_1335569
Residue:486
BDBM50352422
NameBDBM50352422
Synonyms:CHEMBL1823616
TypeSmall organic molecule
Emp. Form.C22H21ClN6O2
Mol. Mass.436.894
SMILESCn1c(nc2ccccc12)-c1noc(n1)C1CCN(CC1)C(=O)Nc1ccccc1Cl