Reaction Details
TargetHistone-lysine N-methyltransferase EHMT2
LigandBDBM50353132
Substrate/Competitorn/a
Meas. Tech.ChEMBL_768504 (CHEMBL1832327)
IC50 18±n/a nM
Citation Liu, FBarsyte-Lovejoy, DAllali-Hassani, AHe, YHerold, JMChen, XYates, CMFrye, SVBrown, PJHuang, JVedadi, MArrowsmith, CHJin, J Optimization of cellular activity of G9a inhibitors 7-aminoalkoxy-quinazolines. J Med Chem54:6139-50 (2011) 
 
Histone-lysine N-methyltransferase EHMT2
Name:Histone-lysine N-methyltransferase EHMT2
Type:Enzyme
Mol. Mass.:132339.87
Organism:Homo sapiens (Human)
Description:Q96KQ7
Residue:1210
BDBM50353132
NameBDBM50353132
Synonyms:CHEMBL1829305
TypeSmall organic molecule
Emp. Form.C37H61N7O2
Mol. Mass.635.9259
SMILESCOc1cc2c(NC3CCN(CC4CCCCC4)CC3)nc(nc2cc1OCCCN1CCCCC1)N1CCCN(CC1)C(C)C