Reaction Details
TargetHistone-lysine N-methyltransferase EHMT2
LigandBDBM50323813
Substrate/Competitorn/a
Meas. Tech.ChEMBL_768501 (CHEMBL1832324)
IC50 11000±n/a nM
Citation Liu, FBarsyte-Lovejoy, DAllali-Hassani, AHe, YHerold, JMChen, XYates, CMFrye, SVBrown, PJHuang, JVedadi, MArrowsmith, CHJin, J Optimization of cellular activity of G9a inhibitors 7-aminoalkoxy-quinazolines. J Med Chem54:6139-50 (2011) 
 
Histone-lysine N-methyltransferase EHMT2
Name:Histone-lysine N-methyltransferase EHMT2
Type:Enzyme
Mol. Mass.:132339.87
Organism:Homo sapiens (Human)
Description:Q96KQ7
Residue:1210
BDBM50323813
NameBDBM50323813
Synonyms:7-(2-(2-(Dimethylamino)ethoxy)ethoxy)-6-methoxy-2-(4-methyl-1,4-diazepan-1-yl)-N-(1-methylpiperidin-4-yl)quinazolin-4-amine | CHEMBL1214066
TypeSmall organic molecule
Emp. Form.C27H45N7O3
Mol. Mass.515.6913
SMILESCOc1cc2c(NC3CCN(C)CC3)nc(nc2cc1OCCOCCN(C)C)N1CCCN(C)CC1