Reaction Details
TargetHistone-lysine N-methyltransferase EHMT2
LigandBDBM50353125
Substrate/Competitorn/a
Meas. Tech.ChEMBL_768494 (CHEMBL1832317)
IC50 9±n/a nM
Citation Liu, FBarsyte-Lovejoy, DAllali-Hassani, AHe, YHerold, JMChen, XYates, CMFrye, SVBrown, PJHuang, JVedadi, MArrowsmith, CHJin, J Optimization of cellular activity of G9a inhibitors 7-aminoalkoxy-quinazolines. J Med Chem54:6139-50 (2011) 
 
Histone-lysine N-methyltransferase EHMT2
Name:Histone-lysine N-methyltransferase EHMT2
Type:Enzyme
Mol. Mass.:132339.87
Organism:Homo sapiens (Human)
Description:Q96KQ7
Residue:1210
BDBM50353125
NameBDBM50353125
Synonyms:CHEMBL1829299
TypeSmall organic molecule
Emp. Form.C36H53N7O2
Mol. Mass.615.8517
SMILESCOc1cc2c(NC3CCN(CC3)C(C)C)nc(nc2cc1OCCCN1CCCC1)N1CCCN(Cc2ccccc2)CC1