Reaction Details
Target11-beta-hydroxysteroid dehydrogenase 1
LigandBDBM50353392
Substrate/Competitorn/a
Meas. Tech.ChEMBL_768815 (CHEMBL1831797)
IC50 0.400000±n/a nM
Citation Xu, ZTice, CMZhao, WCacatian, SYe, YJSingh, SBLindblom, PMcKeever, BMKrosky, PMKruk, BABerbaum, JHarrison, RKJohnson, JABukhtiyarov, YPanemangalore, RScott, BBZhao, YBruno, JGTogias, JGuo, JGuo, RCarroll, PJMcGeehan, GMZhuang, LHe, WClaremon, DA Structure-based design and synthesis of 1,3-oxazinan-2-one inhibitors of 11ß-hydroxysteroid dehydrogenase type 1. J Med Chem54:6050-62 (2011) 
 
11-beta-hydroxysteroid dehydrogenase 1
Name:11-beta-hydroxysteroid dehydrogenase 1
Type:Enzyme
Mol. Mass.:32409.16
Organism:Homo sapiens (Human)
Description:P28845
Residue:292
BDBM50353392
NameBDBM50353392
Synonyms:CHEMBL1829761 US8592410, Comparator 9 | US8598163, 67
TypeSmall organic molecule
Emp. Form.C27H28FNO3
Mol. Mass.433.5145
SMILESC[C@H](N1CC[C@@](CCCO)(OC1=O)c1ccccc1)c1ccc(cc1)-c1ccc(F)cc1