Reaction Details
TargetCholinesterase
LigandBDBM50353680
Substrate/Competitorn/a
Meas. Tech.ChEMBL_770412 (CHEMBL1833721)
IC50 21.1±n/a nM
Citation Tang, HZhao, LZZhao, HTHuang, SLZhong, SMQin, JKChen, ZFHuang, ZSLiang, H Hybrids of oxoisoaporphine-tacrine congeners: novel acetylcholinesterase and acetylcholinesterase-inducedß-amyloid aggregation inhibitors. Eur J Med Chem46:4970-9 (2011) 
 
Cholinesterase
Name:Cholinesterase
Type:Enzyme
Mol. Mass.:65643.35
Organism:Equus caballus (Horse)
Description:P81908
Residue:574
BDBM50353680
NameBDBM50353680
Synonyms:CHEMBL1830632
TypeSmall organic molecule
Emp. Form.C36H35N5O2
Mol. Mass.569.6954
SMILESO=C(CCNCCCNc1c2CCCCCc2nc2ccccc12)Nc1ccc-2c(c1)C(=O)c1cccc3ccnc-2c13