Reaction Details
TargetSodium-dependent noradrenaline transporter
LigandBDBM50353928
Substrate/Competitorn/a
Meas. Tech.ChEMBL_769842 (CHEMBL1831836)
IC50 5±n/a nM
Citation O'Neill, DJAdedoyin, ABray, JADeecher, DCFensome, AGoldberg, JAHarrison, JLeventhal, LMann, CMark, LNogle, LSullivan, NRSpangler, TBTerefenko, EATrybulski, EJUveges, AJVu, AWhiteside, GTZhang, P Discovery of novel selective norepinephrine inhibitors: 1-(2-morpholin-2-ylethyl)-3-aryl-1,3-dihydro-2,1,3-benzothiadiazole 2,2-dioxides (WYE-114152). J Med Chem54:6824-31 (2011) 
 
Sodium-dependent noradrenaline transporter
Name:Sodium-dependent noradrenaline transporter
Type:Multi-pass membrane protein
Mol. Mass.:69337.72
Organism:Homo sapiens (Human)
Description:P23975
Residue:617
BDBM50353928
NameBDBM50353928
Synonyms:CHEMBL1830879
TypeSmall organic molecule
Emp. Form.C18H21N3O3S
Mol. Mass.359.443
SMILESO=S1(=O)N(CC[C@@H]2CNCCO2)c2ccccc2N1c1ccccc1