Reaction Details
TargetNeuropeptide Y receptor type 5
LigandBDBM50354081
Substrate/Competitorn/a
Meas. Tech.ChEMBL_770872 (CHEMBL1837820)
Ki 2.4±n/a nM
Citation Packiarajan, MMarzabadi, MRDesai, MLu, YNoble, SAWong, WCJubian, VChandrasena, GWolinsky, TDZhong, HWalker, MWWiborg, OAndersen, K Discovery of Lu AA33810: a highly selective and potent NPY5 antagonist with in vivo efficacy in a model of mood disorder. Bioorg Med Chem Lett21:5436-41 (2011) 
 
Neuropeptide Y receptor type 5
Name:Neuropeptide Y receptor type 5
Type:Enzyme
Mol. Mass.:50746.64
Organism:Homo sapiens (Human)
Description:Q15761
Residue:445
BDBM50354081
NameBDBM50354081
Synonyms:CHEMBL1836327
TypeSmall organic molecule
Emp. Form.C19H26FN3O3S2
Mol. Mass.427.556
SMILESCC(C)S(=O)(=O)NCCOCCNc1nc-2c(CCCc3ccc(F)cc-23)s1