Reaction Details
TargetNeuropeptide Y receptor type 5
LigandBDBM50354064
Substrate/Competitorn/a
Meas. Tech.ChEMBL_770872 (CHEMBL1837820)
Ki 3.4±n/a nM
Citation Packiarajan, MMarzabadi, MRDesai, MLu, YNoble, SAWong, WCJubian, VChandrasena, GWolinsky, TDZhong, HWalker, MWWiborg, OAndersen, K Discovery of Lu AA33810: a highly selective and potent NPY5 antagonist with in vivo efficacy in a model of mood disorder. Bioorg Med Chem Lett21:5436-41 (2011) 
 
Neuropeptide Y receptor type 5
Name:Neuropeptide Y receptor type 5
Type:Enzyme
Mol. Mass.:50746.64
Organism:Homo sapiens (Human)
Description:Q15761
Residue:445
BDBM50354064
NameBDBM50354064
Synonyms:CHEMBL1836326
TypeSmall organic molecule
Emp. Form.C18H21F4N3O2S2
Mol. Mass.451.502
SMILESFc1ccc2CCCc3sc(NCCCCNS(=O)(=O)CC(F)(F)F)nc3-c2c1