Reaction Details
TargetNeuropeptide Y receptor type 5
LigandBDBM50354065
Substrate/Competitorn/a
Meas. Tech.ChEMBL_770872 (CHEMBL1837820)
Ki 27±n/a nM
Citation Packiarajan, MMarzabadi, MRDesai, MLu, YNoble, SAWong, WCJubian, VChandrasena, GWolinsky, TDZhong, HWalker, MWWiborg, OAndersen, K Discovery of Lu AA33810: a highly selective and potent NPY5 antagonist with in vivo efficacy in a model of mood disorder. Bioorg Med Chem Lett21:5436-41 (2011) 
 
Neuropeptide Y receptor type 5
Name:Neuropeptide Y receptor type 5
Type:Enzyme
Mol. Mass.:50746.64
Organism:Homo sapiens (Human)
Description:Q15761
Residue:445
BDBM50354065
NameBDBM50354065
Synonyms:CHEMBL1836325
TypeSmall organic molecule
Emp. Form.C19H24FN3O2S2
Mol. Mass.409.541
SMILESCS(=O)(=O)N[C@H]1CC[C@@H](CC1)Nc1nc-2c(CCCc3ccc(F)cc-23)s1