Reaction Details
TargetPeroxisome proliferator-activated receptor alpha
LigandBDBM28700
Substrate/Competitorn/a
Meas. Tech.ChEMBL_770708 (CHEMBL1837232)
EC50 4500±n/a nM
Citation Jia, YBhuiyan, MJJun, HJLee, JHHoang, MHLee, HJKim, NLee, DHwang, KYHwang, BYChoi, DWLee, SJ Ursolic acid is a PPAR-a agonist that regulates hepatic lipid metabolism. Bioorg Med Chem Lett21:5876-80 (2011) 
 
Peroxisome proliferator-activated receptor alpha
Name:Peroxisome proliferator-activated receptor alpha
Type:Enzyme
Mol. Mass.:52222.08
Organism:Homo sapiens (Human)
Description:Q07869
Residue:468
BDBM28700
NameBDBM28700
Synonyms:2-(4-(4-Chlorobenzoyl)phenoxy)-2-methylpropionic acid CHEMBL981 FIBRICOR LF 153 procetofenic acid
TypeSmall organic molecule
Emp. Form.C17H15ClO4
Mol. Mass.318.752
SMILESCC(C)(Oc1ccc(cc1)C(=O)c1ccc(Cl)cc1)C(O)=O